BDBM50476601 CHEMBL242367
SMILES COc1cc(CC(O)=O)ccc1OCCCOc1ccc(CC(=O)N(C)CCc2ccccc2)cc1
InChI Key InChIKey=RRSALJRHVDZKNB-UHFFFAOYSA-N
Data  1 IC50
  Tab Delimited (TSV)   2D SDfile   Computed 3D by Vconf -m prep SDfile
Find this compound or compounds like it in BindingDB:
Activity Spreadsheet -- Enzyme Inhibition Constant Data from BindingDB
Found 1 hit for monomerid = 50476601
TargetLeukotriene B4 receptor 2(Homo sapiens (Human))
Zentiva Vufb
Curated by ChEMBL
LigandPNGBDBM50476601(CHEMBL242367)
Affinity DataIC50:  6.70E+4nM. Assay description: Displacement of [3H]LTB4 from LTB4 receptor in guinea pig spleen membrane
Ligand InfoPC cidPC sid
In DepthDetails ArticlePubMed